{"text_format":"1","workbook":"xlsx","n_sheets":16,"sheets":["MENU","Company Dashboard","Sales Analysis","Top 10 Customers","Inventory Analysis","Inventory Statistics","Current & Prior YR BS","Current Month & YTD IS","More Financial Reports","Actual vs Budget IS","Actual vs Prior IS","Act vs Prior BS","Actual vs Budget vs Prior IS","Monthly, Quarterly, & YTD IS","Monthly Quartley & YTD BS","Sheet1"],"not_rendered":{"charts":5,"images":7,"macros":0,"external_links":8,"defined_names":682,"comments":1,"pivot_tables":2},"unopened":[],"bounds":{"document_bytes":16777216,"sheet_cells":100000,"rows_first":2000,"rows_last":500,"rows_between":2000,"halvings":0,"cell_chars":16384,"cell_head_chars":4096},"cells_cut":0,"cells_raw":0,"read":"whole","date_system":"1900"}

{"sheet":"MENU","index":0,"n_rows":12,"n_cols":3,"rows_kept":12,"cut":false,"hidden":false,"merged":[[11,2,11,11]]}
[]
[]
[]
[]
[]
[]
[]
[]
[]
[]
{"$rows_left_out":3}
{"sheet":"Company Dashboard","index":1,"n_rows":46,"n_cols":11,"rows_kept":46,"cut":false,"hidden":false,"merged":[[38,6,38,8],[33,6,33,8],[37,6,37,8],[45,6,45,8],[46,6,46,8],[39,2,39,3],[39,6,39,8],[40,6,40,8],[41,6,41,8],[42,6,42,8],[44,6,44,8],[1,2,1,18],[4,2,5,3],[15,2,16,3],[24,2,24,3],[24,6,24,8],[26,6,26,8],[25,6,25,8],[34,6,34,8],[35,6,35,8],[36,6,36,8],[32,2,32,3],[32,6,32,8],[27,6,27,8],[28,6,28,8],[29,6,29,8],[30,6,30,8]]}
[]
[null,null,"DASHBOARD - UNIVERSAL CONSTRUCTION"]
[null,null,"Period:","March 2015"]
[]
[null,null,"Profit & Loss",null,"Actual","Budget","Variance",null,"Actual ","Budget","Variance"]
[null,null,null,null,"Mar 15","Mar 15",null,null,"YTD","YTD"]
[null,null,"Revenue",null,126309.95000000001,0,126309.95000000001,null,1030393.6400000001,0,1030393.6400000001]
[null,null,"Cost of Goods Sold",null,16595.7,0,-16595.7,null,224827.37000000002,0,-224827.37000000002]
[null,null,"Gross Profit",null,109714.25000000001,0,109714.25000000001,null,805566.27000000014,0,805566.27000000014]
[null,null,"Expenses",null,65658.97,0,-65658.97,null,519039.96999999986,0,-519039.96999999986]
{"$rows_left_out":37}
{"sheet":"Sales Analysis","index":2,"n_rows":236,"n_cols":11,"rows_kept":236,"cut":false,"hidden":false,"merged":[]}
["UNIVERSAL CONSTRUCTION"]
["SALES ANALYSIS"]
["for the period from 01 Jul 2014 to 31 Mar 2015"]
[]
["Service / Inventory","(All)"]
["SalesmanName","(All)"]
["ProductCategory","(All)"]
[]
[null,null,"Data"]
["CustomerName","Product Code Name","Selling Unit Quantity ","Stocking\nUnit\nQuantity ","Average\nSelling Unit\nCost"," Average\nSelling Unit\n Price","Freight ","TotalSale","TotalCost","Gross Profit ","GP %"]
{"$rows_left_out":227}
{"sheet":"Top 10 Customers","index":3,"n_rows":22,"n_cols":10,"rows_kept":22,"cut":false,"hidden":false,"merged":[[1,2,1,9],[2,2,2,9],[3,2,3,9]]}
[]
[null,null,"UNIVERSAL CONSTRUCTION"]
[null,null,"TOP 10 CUSTOMERS - by sales amount"]
[null,null,"for the period from 01 Jul 2014 to 31 Mar 2015"]
[]
[null,null,"TOP 10 CUSTOMERS",null,null,null,null,null,"TOP 10 PRODUCTS"]
[]
[null,null,null,null,null,null,null,null,"Inventory / Service","(All)"]
[]
[null,null,"Sum of TotalLineSale ",null,null,null,null,null,"TotalLineSale "]
{"$rows_left_out":13}
{"sheet":"Inventory Analysis","index":4,"n_rows":79,"n_cols":14,"rows_kept":79,"cut":false,"hidden":false,"merged":[]}
["UNIVERSAL CONSTRUCTION"]
["INVENTORY ANALYSIS"]
["as at 12 Jan 2010"]
[]
[]
["Store Name","(All)"]
["Inventory \nor Service","(All)"]
[]
[null,null,null,"Data"]
["Category Name","Product Code Name","Stocking unit","Avg \nCost\nStockUnit","Avg\nSell Price\nStockUnit","Quantity\nat Start of \nFinancial Year","Quantity \nPurchased \nYTD","No of Units \nSold \nYTD","Transfer/\nAdjustment\n Quantity","Final Stock \non Hand ","Quantity on  \nPurchase Order","Quantity on \nSales\n Order ","Min\nLevel"," ReOrder Quantity"]
{"$rows_left_out":70}
{"sheet":"Inventory Statistics","index":5,"n_rows":113,"n_cols":11,"rows_kept":113,"cut":false,"hidden":false,"merged":[]}
["UNIVERSAL CONSTRUCTION"]
["INVENTORY STATISTICS"]
["as at 12 Jan 2010"]
[]
[]
["Store Name","(All)"]
["Inventory \nor Service","(All)"]
[]
[null,null,null,null,"Data"]
["Category Name","Product Code Name","Last\nSaleDate","Last\nPurchDate","YTD\n Units Sold","YTD \nCOGS","YTD\nSales","YTD\n GP ","YTD \nGP %","Stock on Hand  ","Stock \nValue "]
{"$rows_left_out":104}
{"sheet":"Current & Prior YR BS","index":6,"n_rows":139,"n_cols":10,"rows_kept":139,"cut":false,"hidden":false,"merged":[[4,7,4,8]]}
[]
[null,null,"UNIVERSAL CONSTRUCTION"]
[null,null,"Balance Sheet for Period Ending June 2015"]
[]
[null,null,null,null,null,null,"CURRENT","PRIOR"]
[null,null,null,null,null,null,"Actual","YTD","Variance %"]
["","","","","","","","","",""]
[]
[null,"_AS","ASSETS"]
[]
{"$rows_left_out":130}
{"sheet":"Current Month & YTD IS","index":7,"n_rows":289,"n_cols":22,"rows_kept":289,"cut":false,"hidden":false,"merged":[[4,6,4,8],[4,10,4,12],[4,14,4,16],[4,18,4,20]]}
[]
[null,null,"UNIVERSAL CONSTRUCTION"]
[null,null,"Income Statement for Period Ending June 2015"]
[]
[null,null,null,null,null,null,"Current Mth",null,null,null,"Current Mth",null,null,null,"YTD",null,null,null,"YTD"]
[null,null,null,null,null,null,"Actual","Budget","Variance %",null,"Actual","Prior","Variance %",null,"Actual","Budget","Variance %",null,"Actual","Prior","Variance %"]
["","","","","","","","","","","","","","","","","","","","","",""]
[]
[null,"_RV","REVENUE"]
[]
{"$rows_left_out":280}
{"sheet":"More Financial Reports","index":8,"n_rows":27,"n_cols":9,"rows_kept":27,"cut":false,"hidden":false,"merged":[[2,3,2,11],[3,3,3,11],[5,3,5,11],[12,8,13,9]]}
[]
[]
[]
[null,null,null,"UNIVERSAL CONSTRUCTION"]
[]
[null,null,null,"Financial Analysis"]
[]
[]
[]
[]
{"$rows_left_out":18}
{"sheet":"Actual vs Budget IS","index":9,"n_rows":289,"n_cols":68,"rows_kept":289,"cut":false,"hidden":false,"merged":[[4,6,4,8],[4,10,4,12],[4,14,4,16],[4,20,4,22],[4,24,4,26],[4,28,4,30],[4,62,4,64],[4,34,4,36],[4,38,4,40],[4,42,4,44],[4,48,4,50],[4,52,4,54],[4,56,4,58]]}
[]
[null,null,"UNIVERSAL CONSTRUCTION"]
[null,null,"Income Statement for Period Ending June 2015"]
[]
[null,null,null,null,null,null,"Jul 14",null,null,null,"Aug 14",null,null,null,"Sep 14",null,null,null,"Qtr1",null,"Oct 14",null,null,null,"Nov 14",null,null,null,"Dec 14",null,null,null,"Qtr2",null,"Jan 15",null,null,null,"Feb 15",null,null,null,"Mar 15",null,null,null,"Qtr3",null,"Apr 15",null,null,null,"May 15",null,null,null,"Jun 15",null,null,null,"Qtr4",null,"YTD",null,null,null,"ANNUAL BUDGET"]
[null,null,null,null,null,null,"Actual","Budget","Variance %",null,"Actual","Budget","Variance %",null,"Actual","Budget","Variance %",null,"Actual",null,"Actual","Budget","Variance %",null,"Actual","Budget","Variance %",null,"Actual","Budget","Variance %",null,"Actual",null,"Actual","Budget","Variance %",null,"Actual","Budget","Variance %",null,"Actual","Budget","Variance %",null,"Actual",null,"Actual","Budget","Variance %",null,"Actual","Budget","Variance %",null,"Actual","Budget","Variance %",null,"Actual",null,"Actual","Budget","Variance %",null,"YTD"]
["","","","","","","","","","","","","","","","","","","","","","","","","","","","","","","","","","","","","","","","","","","","","","","","","","","","","","","","","","","","","","","","","","","",""]
[]
[null,"_RV","REVENUE"]
[]
{"$rows_left_out":280}
{"sheet":"Actual vs Prior IS","index":10,"n_rows":289,"n_cols":54,"rows_kept":289,"cut":false,"hidden":false,"merged":[[4,49,4,50]]}
[]
[null,null,"UNIVERSAL CONSTRUCTION"]
[null,null,"Income Statement for Period Ending June 2015"]
[]
[null,null,null,null,null,"Jul 14","Jul 13",null,"Aug 14","Aug 13",null,"Sep 14","Sep 13",null,"Qtr1",null,"Oct 14","Oct 13",null,"Nov 14","Nov 13",null,"Dec 14","Dec 13",null,"Qtr2",null,"Jan 15","Jan 14",null,"Feb 15","Feb 14",null,"Mar 15","Mar 14",null,"Qtr3",null,"Apr 15","Apr 14",null,"May 15","May 14",null,"Jun 15","Jun 14",null,"Qtr4",null,"YTD",null,null,2014]
[null,null,null,null,null,"Actual","Prior",null,"Actual","Prior",null,"Actual","Prior",null,"Actual",null,"Actual","Prior",null,"Actual","Prior",null,"Actual","Prior",null,"Actual",null,"Actual","Prior",null,"Actual","Prior",null,"Actual","Prior",null,"Actual",null,"Actual","Prior",null,"Actual","Prior",null,"Actual","Prior",null,"Actual",null,"Actual","Prior",null,"YTD"]
["","","","","","","","","","","","","","","","","","","","","","","","","","","","","","","","","","","","","","","","","","","","","","","","","","","","","",""]
[]
[null,"_RV","REVENUE"]
[]
{"$rows_left_out":280}
{"sheet":"Act vs Prior BS","index":11,"n_rows":139,"n_cols":46,"rows_kept":139,"cut":false,"hidden":false,"merged":[[4,43,4,44]]}
[]
[null,null,{"$f":"HLOOKUP(\"CompanyName\",[4]ACTData!CompanyName,2)","v":"UNIVERSAL CONSTRUCTION"}]
[null,null,{"$f":"CONCATENATE(\"Balance Sheet for Period Ending \", [4]!SelectedDate)","v":"Balance Sheet for Period Ending June 2015"}]
[]
[null,null,null,null,null,{"$f":"[4]Lookup!$K$1","v":"Jul 14"},null,{"$f":"[4]Lookup!$L$1","v":"Jul 14"},{"$f":"[4]Lookup!$N$1","v":"Jul 13"},null,{"$f":"[4]Lookup!$O$1","v":"Aug 14"},{"$f":"[4]Lookup!$Q$1","v":"Aug 13"},null,{"$f":"[4]Lookup!$R$1","v":"Sep 14"},{"$f":"[4]Lookup!$T$1","v":"Sep 13"},null,{"$f":"[4]Lookup!$U$1","v":"Oct 14"},{"$f":"[4]Lookup!$W$1","v":"Oct 13"},null,{"$f":"[4]Lookup!$X$1","v":"Nov 14"},{"$f":"[4]Lookup!$Z$1","v":"Nov 13"},null,{"$f":"[4]Lookup!$AA$1","v":"Dec 14"},{"$f":"[4]Lookup!$AC$1","v":"Dec 13"},null,{"$f":"[4]Lookup!$AD$1","v":"Jan 15"},{"$f":"[4]Lookup!$AF$1","v":"Jan 14"},null,{"$f":"[4]Lookup!$AG$1","v":"Feb 15"},{"$f":"[4]Lookup!$AI$1","v":"Feb 14"},null,{"$f":"[4]Lookup!$AJ$1","v":"Mar 15"},{"$f":"[4]Lookup!$AL$1","v":"Mar 14"},null,{"$f":"[4]Lookup!$AM$1","v":"Apr 15"},{"$f":"[4]Lookup!$AO$1","v":"Apr 14"},null,{"$f":"[4]Lookup!$AP$1","v":"May 15"},{"$f":"[4]Lookup!$AR$1","v":"May 14"},null,{"$f":"[4]Lookup!$AS$1","v":"Jun 15"},{"$f":"[4]Lookup!$AU$1","v":"Jun 14"},null,{"$f":"[4]Lookup!$AY$1","v":"YTD"}]
[null,null,null,null,null,"Opening",null,"Actual","Prior",null,"Actual","Prior",null,"Actual","Prior",null,"Actual","Prior",null,"Actual","Prior",null,"Actual","Prior",null,"Actual","Prior",null,"Actual","Prior",null,"Actual","Prior",null,"Actual","Prior",null,"Actual","Prior",null,"Actual","Prior",null,"Actual","Prior"]
["","","","","","","","","","","","","","","","","","","","","","","","","","","","","","","","","","","","","","","","","","","","","",""]
[]
[null,"_AS","ASSETS"]
[]
{"$rows_left_out":130}
{"sheet":"Actual vs Budget vs Prior IS","index":12,"n_rows":289,"n_cols":61,"rows_kept":289,"cut":false,"hidden":false,"merged":[[4,5,4,6],[4,9,4,10],[4,13,4,14],[4,17,4,18],[4,21,4,22],[4,25,4,26],[4,53,4,55],[4,29,4,30],[4,33,4,34],[4,37,4,38],[4,41,4,42],[4,45,4,46],[4,49,4,50]]}
[]
[null,null,"UNIVERSAL CONSTRUCTION"]
[null,null,"Income Statement for Period Ending June 2015"]
[]
[null,null,null,null,null,"Jul 14",null,"Jul 13",null,"Aug 14",null,"Aug 13",null,"Sep 14",null,"Sep 13",null,"Oct 14",null,"Oct 13",null,"Nov 14",null,"Nov 13",null,"Dec 14",null,"Dec 13",null,"Jan 15",null,"Jan 14",null,"Feb 15",null,"Feb 14",null,"Mar 15",null,"Mar 14",null,"Apr 15",null,"Apr 14",null,"May 15",null,"May 14",null,"Jun 15",null,"Jun 14",null,"YTD",null,null,null,"ANNUAL BUDGET",null,2014]
[null,null,null,null,null,"Actual","Budget","Prior",null,"Actual","Budget","Prior",null,"Actual","Budget","Prior",null,"Actual","Budget","Prior",null,"Actual","Budget","Prior",null,"Actual","Budget","Prior",null,"Actual","Budget","Prior",null,"Actual","Budget","Prior",null,"Actual","Budget","Prior",null,"Actual","Budget","Prior",null,"Actual","Budget","Prior",null,"Actual","Budget","Prior",null,"Actual","Budget","Prior",null,"YTD",null,"YTD"]
["","","","","","","","","","","","","","","","","","","","","","","","","","","","","","","","","","","","","","","","","","","","","","","","","","","","","","","","","","","","",""]
[]
[null,"_RV","REVENUE"]
[]
{"$rows_left_out":280}
{"sheet":"Monthly, Quarterly, & YTD IS","index":13,"n_rows":289,"n_cols":27,"rows_kept":289,"cut":false,"hidden":false,"merged":[]}
[]
[null,null,"UNIVERSAL CONSTRUCTION"]
[null,null,"Income Statement for Period Ending June 2015"]
[]
[null,null,null,null,null,"Jul 14","Aug 14","Sep 14","Qtr1",null,"Oct 14","Nov 14","Dec 14","Qtr2",null,"Jan 15","Feb 15","Mar 15","Qtr3",null,"Apr 15","May 15","Jun 15","Qtr4",null,"YTD"]
[null,null,null,null,null,"Actual","Actual","Actual","Actual",null,"Actual","Actual","Actual","Actual",null,"Actual","Actual","Actual","Actual",null,"Actual","Actual","Actual","Actual",null,"Actual"]
["","","","","","","","","","","","","","","","","","","","","","","","","","",""]
[]
[null,"_RV","REVENUE"]
[]
{"$rows_left_out":280}
{"sheet":"Monthly Quartley & YTD BS","index":14,"n_rows":139,"n_cols":29,"rows_kept":139,"cut":false,"hidden":false,"merged":[]}
[]
[null,null,{"$f":"HLOOKUP(\"CompanyName\",[4]ACTData!CompanyName,2)","v":"UNIVERSAL CONSTRUCTION"}]
[null,null,{"$f":"CONCATENATE(\"Balance Sheet for Period Ending \", [4]!SelectedDate)","v":"Balance Sheet for Period Ending June 2015"}]
[]
[null,null,null,null,null,{"$f":"[4]Lookup!$K$1","v":"Jul 14"},null,{"$f":"[4]Lookup!$L$1","v":"Jul 14"},{"$f":"[4]Lookup!$O$1","v":"Aug 14"},{"$f":"[4]Lookup!$R$1","v":"Sep 14"},{"$f":"[4]Lookup!$BE$1","v":"Qtr1"},null,{"$f":"[4]Lookup!$U$1","v":"Oct 14"},{"$f":"[4]Lookup!$X$1","v":"Nov 14"},{"$f":"[4]Lookup!$AA$1","v":"Dec 14"},{"$f":"[4]Lookup!$BF$1","v":"Qtr2"},null,{"$f":"[4]Lookup!$AD$1","v":"Jan 15"},{"$f":"[4]Lookup!$AG$1","v":"Feb 15"},{"$f":"[4]Lookup!$AJ$1","v":"Mar 15"},{"$f":"[4]Lookup!$BG$1","v":"Qtr3"},null,{"$f":"[4]Lookup!$AM$1","v":"Apr 15"},{"$f":"[4]Lookup!$AP$1","v":"May 15"},{"$f":"[4]Lookup!$AS$1","v":"Jun 15"},{"$f":"[4]Lookup!$BH$1","v":"Qtr4"},null,{"$f":"[4]Lookup!$AY$1","v":"YTD"}]
[null,null,null,null,null,"Opening",null,"Actual","Actual","Actual","Actual",null,"Actual","Actual","Actual","Actual",null,"Actual","Actual","Actual","Actual",null,"Actual","Actual","Actual","Actual",null,"Actual"]
["","","","","","","","","","","","","","","","","","","","","","","","","","","","",""]
[]
[null,"_AS","ASSETS"]
[]
{"$rows_left_out":130}
{"sheet":"Sheet1","index":15,"n_rows":0,"n_cols":0,"rows_kept":0,"cut":false,"hidden":false,"merged":[]}